Unnamed: 0,Unnamed: 1,Unnamed: 2,Unnamed: 3,Unnamed: 4,Unnamed: 5,Unnamed: 6,Unnamed: 7,Unnamed: 8,Unnamed: 9,Unnamed: 10,Unnamed: 11
,,,,,,,,,,,
,,,,,,,,,,,
,Fig 4 e,,,,,,Fig 4 o,,,,
,,,,,,,,,,,
,ICU admission to death (days),,,,,,Ang II levels (pg/mg),,,,
,COVID-19-P1,COVID-19-P2,COVID-19-P3,,,,CONTROL,COVID-19,COVID-19-P1,COVID-19-P2,COVID-19-P3
,20,21,25,,,,2150,3695,3393,3695,4097
,10,20,,,,,1702,4097,2693,4701,
,11,16,,,,,2206,4701,3665,2862,
,10,10,,,,,3162,2862,3331,2576,
,8,23,,,,,2850,2376,2847,3662,
,,,,,,,,3393,,,
,,,,,,,,2693,,,
,Fig 4 j,,,,,,,3665,,,
,,,,,,,,3331,,,
,Heat map (fold),,,,,,,3662,,,
,,,,,,,,2847,,,
,ACE,,,,,,,,,,
,COVID-19,COVID-19-P1,COVID-19-P2,COVID-19-P3,,,,,,,
,0.234,0.234,0.067,0.163,,,,,,,
,0.551,0.551,0.07,,,,,,,,
,0.643,0.643,0.207,,,,,,,,
,0.254,0.254,0.29,,,,,,,,
,0.528,0.528,1.216,,,,,,,,
,0.067,,,,,,,,,,
,0.07,,,,,,,,,,
,0.207,,,,,,,,,,
,0.29,,,,,,,,,,
,1.216,,,,,,,,,,
,0.163,,,,,,,,,,
,,,,,,,,,,,
,,,,,,,,,,,
,ACE2,,,,,,,,,,
,COVID-19,COVID-19-P1,COVID-19-P2,COVID-19-P3,,,,,,,
,3.093,3.093,0.628,0.599,,,,,,,
,1.936,1.936,0.57,,,,,,,,
,1.269,1.269,0.415,,,,,,,,
,1.059,1.059,0.294,,,,,,,,
,1.301,1.301,0.443,,,,,,,,
,0.628,,,,,,,,,,
,0.57,,,,,,,,,,
,0.415,,,,,,,,,,
,0.294,,,,,,,,,,
,0.443,,,,,,,,,,
,0.599,,,,,,,,,,
,,,,,,,,,,,
,AGTR1,,,,,,,,,,
,COVID-19,COVID-19-P1,COVID-19-P2,COVID-19-P3,,,,,,,
,2.821,2.821,2.578,1.308,,,,,,,
,4.259,4.259,3.151,,,,,,,,
,3.077,3.077,1.916,,,,,,,,
,3.58,3.58,2.466,,,,,,,,
,2.214,2.214,3.038,,,,,,,,
,2.578,,,,,,,,,,
,3.151,,,,,,,,,,
,1.916,,,,,,,,,,
,2.466,,,,,,,,,,
,3.038,,,,,,,,,,
,1.308,,,,,,,,,,
